{"text_format":"1","workbook":"xlsx","n_sheets":12,"sheets":["Front Page","Disclaimer","Methodology","Significance Description","Summary","Spatial_Strategy_Policies","Option A","Option A1","Option B","Option C","Option D","Option E"],"not_rendered":{"charts":0,"images":1,"macros":0,"external_links":0,"defined_names":2,"comments":0,"pivot_tables":0},"unopened":[],"bounds":{"document_bytes":16777216,"sheet_cells":100000,"rows_first":2000,"rows_last":500,"rows_between":2000,"halvings":0,"cell_chars":16384,"cell_head_chars":4096},"cells_cut":0,"cells_raw":0,"read":"whole","date_system":"1900"}

{"sheet":"Front Page","index":0,"n_rows":24,"n_cols":11,"rows_kept":24,"cut":false,"hidden":false,"merged":[[7,2,8,10]]}
[]
[]
[]
[]
[]
[]
{"$rows_left_out":19}
{"sheet":"Disclaimer","index":1,"n_rows":38,"n_cols":7,"rows_kept":38,"cut":false,"hidden":false,"merged":[[10,4,10,6],[19,2,32,6],[35,1,35,2],[35,6,35,7],[36,1,36,2],[36,6,36,7],[37,1,37,2],[37,6,37,7],[38,1,38,2],[38,6,38,7],[39,1,39,2],[39,6,39,7]]}
[]
[]
[]
[]
[null,null,null,"Contract  No:"]
[]
{"$rows_left_out":33}
{"sheet":"Methodology","index":2,"n_rows":19,"n_cols":7,"rows_kept":19,"cut":false,"hidden":false,"merged":[[16,0,16,7],[17,0,17,7],[18,0,18,7],[11,0,11,7],[12,0,12,7],[13,0,13,7],[14,0,14,7],[15,0,15,7],[2,1,2,3],[3,1,3,3],[4,1,4,3],[5,1,5,3],[7,0,7,1],[7,2,7,6]]}
["The methodology used for the assessment of all policies is outlined below, with an explanation given under each header. The same assessment matrices has been used for the assessment of all policies, hence all follow the same format. "]
[]
["Spatial Option"]
["Option Summary"]
["Option Description"]
["Assumptions Made"]
{"$rows_left_out":14}
{"sheet":"Significance Description","index":3,"n_rows":23,"n_cols":10,"rows_kept":23,"cut":false,"hidden":false,"merged":[[22,7,27,7],[22,8,27,8],[22,9,27,9],[2,1,2,2],[2,7,2,9],[4,7,11,7],[4,8,11,8],[4,9,11,9],[12,7,18,7],[12,8,18,8],[12,9,18,9],[7,1,11,1],[12,1,15,1],[16,1,19,1]]}
[]
[]
[null,"Nature of effects",null,null,null,null,null,"Significance Scores"]
[null,"Criterion","Description",null,null,null,null,"Symbol","Definitions of Significance of Effects Against the SA Objectives","Assumptions on the nature of effects"]
[null,"Significance ","An assessment of the significance of the potential effects identified. This could be a positive effect, negative effect, neutral effect, significant positive effect or significant negative effect. The definitions for these effects are detailed to the right.",null,null,null,null,"++","Significant Positive Effect: the policy option supports the achievement of this objective; it addresses all relevant assessment questions and could result in a potentially significant beneficial effect e.g. improved access by walking and cycling modes to a local or town centre","Permanent\nContinual\nMagnitude: High 80%+ receptor or environmental capacity affected; or Medium 40-80% of receptor or environmental capacity of affected\nThe effect could be to:\n•\tenhance and redefine the location in a positive manner, making a contribution at a national or international scale; \n•\trepair or restore receptors badly damaged or degraded through previous uses; and/or \n•\timprove one or more key elements/features/ characteristics of a receptor with recognised quality such as a specific regional or national designation."]
[null,"Permanent/temporary","An assessment of whether the predicted effects would be permanent (P), or temporary (T). "]
{"$rows_left_out":18}
{"sheet":"Summary","index":4,"n_rows":8,"n_cols":22,"rows_kept":8,"cut":false,"hidden":false,"merged":[[1,20,1,21]]}
[]
[null,"Spatial Option","SA1","SA2","SA3","SA4","SA5","SA6","SA7","SA8","SA9","SA10","SA11","SA12","SA13","SA14","SA15","SA16","SA17",null,"Key"]
[null,"Option A",{"$f":"IFERROR(VLOOKUP('Option A'!E8, Summary!$U:$V, 2, FALSE), \"\")","v":"+"},{"$f":"IFERROR(VLOOKUP('Option A'!E9, Summary!$U:$V, 2, FALSE), \"\")","v":"+"},{"$f":"IFERROR(VLOOKUP('Option A'!E10, Summary!$U:$V, 2, FALSE), \"\")","v":"+ +"},{"$f":"IFERROR(VLOOKUP('Option A'!E11, Summary!$U:$V, 2, FALSE), \"\")","v":"+"},{"$f":"IFERROR(VLOOKUP('Option A'!E12, Summary!$U:$V, 2, FALSE), \"\")","v":"+"},{"$f":"IFERROR(VLOOKUP('Option A'!E13, Summary!$U:$V, 2, FALSE), \"\")","v":"+"},{"$f":"IFERROR(VLOOKUP('Option A'!E14, Summary!$U:$V, 2, FALSE), \"\")","v":"+"},{"$f":"IFERROR(VLOOKUP('Option A'!E15, Summary!$U:$V, 2, FALSE), \"\")","v":"-"},{"$f":"IFERROR(VLOOKUP('Option A'!E16, Summary!$U:$V, 2, FALSE), \"\")","v":"-"},{"$f":"IFERROR(VLOOKUP('Option A'!E17, Summary!$U:$V, 2, FALSE), \"\")","v":"?"},{"$f":"IFERROR(VLOOKUP('Option A'!E18, Summary!$U:$V, 2, FALSE), \"\")","v":"-"},{"$f":"IFERROR(VLOOKUP('Option A'!E19, Summary!$U:$V, 2, FALSE), \"\")","v":"-"},{"$f":"IFERROR(VLOOKUP('Option A'!E20, Summary!$U:$V, 2, FALSE), \"\")","v":"-"},{"$f":"IFERROR(VLOOKUP('Option A'!E21, Summary!$U:$V, 2, FALSE), \"\")","v":"+"},{"$f":"IFERROR(VLOOKUP('Option A'!E22, Summary!$U:$V, 2, FALSE), \"\")","v":"+"},{"$f":"IFERROR(VLOOKUP('Option A'!E23, Summary!$U:$V, 2, FALSE), \"\")","v":"-"},{"$f":"IFERROR(VLOOKUP('Option A'!E24, Summary!$U:$V, 2, FALSE), \"\")","v":"+"},null,"Significant positive","+ +"]
[null,"Option A1",{"$f":"IFERROR(VLOOKUP('Option A1'!E8, Summary!$U:$V, 2, FALSE), \"\")","v":"+"},{"$f":"IFERROR(VLOOKUP('Option A1'!E9, Summary!$U:$V, 2, FALSE), \"\")","v":"+"},{"$f":"IFERROR(VLOOKUP('Option A1'!E10, Summary!$U:$V, 2, FALSE), \"\")","v":"-"},{"$f":"IFERROR(VLOOKUP('Option A1'!E11, Summary!$U:$V, 2, FALSE), \"\")","v":"-"},{"$f":"IFERROR(VLOOKUP('Option A1'!E12, Summary!$U:$V, 2, FALSE), \"\")","v":"+"},{"$f":"IFERROR(VLOOKUP('Option A1'!E13, Summary!$U:$V, 2, FALSE), \"\")","v":"?"},{"$f":"IFERROR(VLOOKUP('Option A1'!E14, Summary!$U:$V, 2, FALSE), \"\")","v":"+"},{"$f":"IFERROR(VLOOKUP('Option A1'!E15, Summary!$U:$V, 2, FALSE), \"\")","v":"-"},{"$f":"IFERROR(VLOOKUP('Option A1'!E16, Summary!$U:$V, 2, FALSE), \"\")","v":"-"},{"$f":"IFERROR(VLOOKUP('Option A1'!E17, Summary!$U:$V, 2, FALSE), \"\")","v":"?"},{"$f":"IFERROR(VLOOKUP('Option A1'!E18, Summary!$U:$V, 2, FALSE), \"\")","v":"-"},{"$f":"IFERROR(VLOOKUP('Option A1'!E19, Summary!$U:$V, 2, FALSE), \"\")","v":"- -"},{"$f":"IFERROR(VLOOKUP('Option A1'!E20, Summary!$U:$V, 2, FALSE), \"\")","v":"- -"},{"$f":"IFERROR(VLOOKUP('Option A1'!E21, Summary!$U:$V, 2, FALSE), \"\")","v":"+"},{"$f":"IFERROR(VLOOKUP('Option A1'!E22, Summary!$U:$V, 2, FALSE), \"\")","v":"+"},{"$f":"IFERROR(VLOOKUP('Option A1'!E23, Summary!$U:$V, 2, FALSE), \"\")","v":"-"},{"$f":"IFERROR(VLOOKUP('Option A1'!E24, Summary!$U:$V, 2, FALSE), \"\")","v":"+"},null,"Minor Positive","+"]
[null,"Option B",{"$f":"IFERROR(VLOOKUP('Option B'!E8, Summary!$U:$V, 2, FALSE), \"\")","v":"-"},{"$f":"IFERROR(VLOOKUP('Option B'!E9, Summary!$U:$V, 2, FALSE), \"\")","v":"-"},{"$f":"IFERROR(VLOOKUP('Option B'!E10, Summary!$U:$V, 2, FALSE), \"\")","v":"- -"},{"$f":"IFERROR(VLOOKUP('Option B'!E11, Summary!$U:$V, 2, FALSE), \"\")","v":"-"},{"$f":"IFERROR(VLOOKUP('Option B'!E12, Summary!$U:$V, 2, FALSE), \"\")","v":"?"},{"$f":"IFERROR(VLOOKUP('Option B'!E13, Summary!$U:$V, 2, FALSE), \"\")","v":"+ +"},{"$f":"IFERROR(VLOOKUP('Option B'!E14, Summary!$U:$V, 2, FALSE), \"\")","v":"- -"},{"$f":"IFERROR(VLOOKUP('Option B'!E15, Summary!$U:$V, 2, FALSE), \"\")","v":"- -"},{"$f":"IFERROR(VLOOKUP('Option B'!E16, Summary!$U:$V, 2, FALSE), \"\")","v":"- -"},{"$f":"IFERROR(VLOOKUP('Option B'!E17, Summary!$U:$V, 2, FALSE), \"\")","v":"- -"},{"$f":"IFERROR(VLOOKUP('Option B'!E18, Summary!$U:$V, 2, FALSE), \"\")","v":"-"},{"$f":"IFERROR(VLOOKUP('Option B'!E19, Summary!$U:$V, 2, FALSE), \"\")","v":"- -"},{"$f":"IFERROR(VLOOKUP('Option B'!E20, Summary!$U:$V, 2, FALSE), \"\")","v":"- -"},{"$f":"IFERROR(VLOOKUP('Option B'!E21, Summary!$U:$V, 2, FALSE), \"\")","v":"-"},{"$f":"IFERROR(VLOOKUP('Option B'!E22, Summary!$U:$V, 2, FALSE), \"\")","v":"-"},{"$f":"IFERROR(VLOOKUP('Option B'!E23, Summary!$U:$V, 2, FALSE), \"\")","v":"- -"},{"$f":"IFERROR(VLOOKUP('Option B'!E24, Summary!$U:$V, 2, FALSE), \"\")","v":"-"},null,"Neutral",0]
[null,"Option C",{"$f":"IFERROR(VLOOKUP('Option C'!E8, Summary!$U:$V, 2, FALSE), \"\")","v":"-"},{"$f":"IFERROR(VLOOKUP('Option C'!E9, Summary!$U:$V, 2, FALSE), \"\")","v":"-"},{"$f":"IFERROR(VLOOKUP('Option C'!E10, Summary!$U:$V, 2, FALSE), \"\")","v":"-"},{"$f":"IFERROR(VLOOKUP('Option C'!E11, Summary!$U:$V, 2, FALSE), \"\")","v":"-"},{"$f":"IFERROR(VLOOKUP('Option C'!E12, Summary!$U:$V, 2, FALSE), \"\")","v":"+"},{"$f":"IFERROR(VLOOKUP('Option C'!E13, Summary!$U:$V, 2, FALSE), \"\")","v":"- -"},{"$f":"IFERROR(VLOOKUP('Option C'!E14, Summary!$U:$V, 2, FALSE), \"\")","v":"?"},{"$f":"IFERROR(VLOOKUP('Option C'!E15, Summary!$U:$V, 2, FALSE), \"\")","v":"?"},{"$f":"IFERROR(VLOOKUP('Option C'!E16, Summary!$U:$V, 2, FALSE), \"\")","v":"?"},{"$f":"IFERROR(VLOOKUP('Option C'!E17, Summary!$U:$V, 2, FALSE), \"\")","v":"?"},{"$f":"IFERROR(VLOOKUP('Option C'!E18, Summary!$U:$V, 2, FALSE), \"\")","v":"-"},{"$f":"IFERROR(VLOOKUP('Option C'!E19, Summary!$U:$V, 2, FALSE), \"\")","v":"-"},{"$f":"IFERROR(VLOOKUP('Option C'!E20, Summary!$U:$V, 2, FALSE), \"\")","v":"?"},{"$f":"IFERROR(VLOOKUP('Option C'!E21, Summary!$U:$V, 2, FALSE), \"\")","v":"?"},{"$f":"IFERROR(VLOOKUP('Option C'!E22, Summary!$U:$V, 2, FALSE), \"\")","v":"?"},{"$f":"IFERROR(VLOOKUP('Option C'!E23, Summary!$U:$V, 2, FALSE), \"\")","v":"?"},{"$f":"IFERROR(VLOOKUP('Option C'!E24, Summary!$U:$V, 2, FALSE), \"\")","v":"?"},null,"Minor Negative","-"]
{"$rows_left_out":3}
{"sheet":"Spatial_Strategy_Policies","index":5,"n_rows":22,"n_cols":13,"rows_kept":22,"cut":false,"hidden":true,"merged":[[0,2,0,3],[1,2,1,3],[2,2,2,3],[4,0,4,2],[4,3,4,12]]}
["Policy/Alternative name",null,"Spatial Strategy Policy 1: Overall Objectives\nSpatial Strategy 2: Making Effective Use of Land and Resources"]
["Chapter",null,"Design\n"]
["Policy/alternative description"]
[]
["SA Framework",null,null,"SA Policy Assessment"]
["SA objective","SA","SA sub-objective","Direct/\nIndirect","Magnitude","Duration","Spatial Extent","Permanence/ Reversibility","Significance","Description of potential effects","Potential for cumulative effects? ","Mitigation","Enhancements"]
{"$rows_left_out":17}
{"sheet":"Option A","index":6,"n_rows":24,"n_cols":7,"rows_kept":24,"cut":false,"hidden":false,"merged":[[5,0,5,1],[0,1,0,3],[1,1,1,3],[2,1,2,3],[3,1,3,3],[5,2,5,6]]}
["Spatial Option","Option A"]
["Option Summary","Development focused on brownfield, and City Centre sites identified through the allocations process, then the residual need met by sustainable greenfield sites within the Derby administrative boundary and meeting need through HMA contributions."]
["Option Description","Concentrate growth on brownfield and city centre land first, with utilisation of greenfield land where necessary.\nExisting previously developed land in the city centre is utilised and redeveloped for housing and employment use. \nAdditional housing is located on greenfield land within the Derby City administrative boundary. \nNew employment land is to be contained on three strategic employment sites and the city centre. Both Smart Parc and Indurent Park are on previously developed land. Infinity Park is greenfield.  "]
["Assumptions Made","Housing Growth - 12,500, capacity capped below the 18,340 net new homes needed over the plan period.\nIt is assumed that the proportion of affordable housing achieved would be in line with the provision proposed in the Local Plan.\nEmployment Land - 130ha "]
[]
["SA Framework",null,"SA Assessment"]
{"$rows_left_out":19}
{"sheet":"Option A1","index":7,"n_rows":24,"n_cols":7,"rows_kept":24,"cut":false,"hidden":false,"merged":[[0,1,0,3],[1,1,1,3],[2,1,2,3],[3,1,3,3],[5,0,5,1],[5,2,5,6]]}
["Spatial Option","Option A1"]
["Option Summary","Require brownfield allocations to come forward and be given planning permission before greenfield sites"]
["Option Description","As option A, but with a phasing requirement for green field allocations, requiring brownfield allocations to come first.\nEmployment land to be delivered as in Option A."]
["Assumptions Made","Housing Growth - 12,500, capacity capped below the 18,340 net new homes needed over the plan period.\nIt is assumed that the proportion of affordable housing achieved would be in line with the provision proposed in the Local Plan.\nEmployment Land - 130ha "]
[]
["SA Framework",null,"SA Assessment"]
{"$rows_left_out":19}
{"sheet":"Option B","index":8,"n_rows":24,"n_cols":7,"rows_kept":24,"cut":false,"hidden":false,"merged":[[0,1,0,3],[1,1,1,3],[2,1,2,3],[3,1,3,3],[5,0,5,1],[5,2,5,6]]}
["Spatial Option","Option B"]
["Option Summary","Brownfield and greenfield development fully meeting the standard method housing need within the Derby administrative area boundary"]
["Option Description","Housing and/or employment land is developed on all identified deliverable brownfield sites (approx. 4,500 including both permissions and new allocations) the remaining green field locations on Green Belt land, regardless of whether they are identified as grey belt, as well as green wedge land, regardless of its condition and linkage to the wider area would accommodate the remaining 13,840 units. \nEmployment land to be delivered as in Option A."]
["Assumptions Made","Housing Growth - 18,340 net homes (in line with standard method).\nIt is assumed that the proportion of affordable housing achieved would be in line with the requirements of the standard method.\nEmployment Land - 130ha "]
[]
["SA Framework",null,"SA Assessment"]
{"$rows_left_out":19}
{"sheet":"Option C","index":9,"n_rows":24,"n_cols":7,"rows_kept":24,"cut":false,"hidden":false,"merged":[[0,1,0,3],[1,1,1,3],[2,1,2,3],[3,1,3,3],[5,0,5,1],[5,2,5,6]]}
["Spatial Option","Option C"]
["Option Summary","Export greater proportion of housing needs to HMA neighbouring authorities."]
["Option Description","4,500 homes would be accommodated within the City Centre as part of regeneration allocations and permissions, and approximately 1,800 would be met through windfalls, but no greenfield allocations would be made within the Derby administrative boundary outside the City Centre. \nNeighbouring authorities would be requested to meet the remaining 12,040 homes required by the city in the standard method.\nEmployment land to be delivered as in Option A."]
["Assumptions Made","Housing Growth - Approximately 6,300 homes within the City and the rest exported to South Derbyshire and Amber Valley\nIt is assumed that the proportion of affordable housing achieved would be in line with the provision proposed in the Local Plan, but fall short of Derby's requirements.\nEmployment Land - 130ha "]
[]
["SA Framework",null,"SA Assessment"]
{"$rows_left_out":19}
{"sheet":"Option D","index":10,"n_rows":24,"n_cols":7,"rows_kept":24,"cut":false,"hidden":false,"merged":[[0,1,0,3],[1,1,1,3],[2,1,2,3],[3,1,3,3],[5,0,5,1],[5,2,5,6]]}
["Spatial Option","Option D"]
["Option Summary","A new settlement which meets the City’s full housing needs"]
["Option Description","All of the City’s growth needs would be met through the development of a new settlement.\nEmployment land to be delivered as in Option A."]
["Assumptions Made","Housing Growth - 18,340 net homes (in line with standard method).\nEmployment Land - 130ha \nIt is assumed that the proportion of affordable housing achieved would be in line with the requirements of the standard method.\nIt is assumed that the new settlement would be developed outside of Derby's administrative area.\nIt is assumed that the new settlement would include employment provision, alongside community facilities such as recreation."]
[]
["SA Framework",null,"SA Assessment"]
{"$rows_left_out":19}
{"sheet":"Option E","index":11,"n_rows":24,"n_cols":7,"rows_kept":24,"cut":false,"hidden":false,"merged":[[0,1,0,3],[1,1,1,3],[2,1,2,3],[3,1,3,3],[5,0,5,1],[5,2,5,6]]}
["Spatial Option","Option E"]
["Option Summary","Allocate sufficient housing to allow the City’s full affordable needs to be met within the Derby administrative boundary."]
["Option Description","This option would mean that the plan’s full affordable need would be met through allocating sufficient development that AH needs could be met in entirety.\nHousing and/or employment land is developed on all identified deliverable brownfield sites (approx. 4,500 including both permissions and new allocations) the remaining green field locations on Green Belt land, regardless of whether they are identified as grey belt, as well as Green Wedge land, regardless of its condition and linkage to the wider area would accommodate the remaining 13,840 plus units.\nThis option is similar to Option B but a greater proportion of homes would be affordable. This may be delivered through higher density development on the same sites as Option B.   \nEmployment land to be delivered as in Option A."]
["Assumptions Made","Housing Growth – More than 18,340 net homes (standard method)\nIt is assumed that this option would fully meet Derby's affordable housing need.\nEmployment Land - 130ha "]
[]
["SA Framework",null,"SA Assessment"]
{"$rows_left_out":18}