{"text_format":"1","workbook":"xlsx","n_sheets":17,"sheets":["Front Page","Disclaimer","Methodology","Significance Description","Summary","Spatial_Strategy_Policies","General Development Principles","Housing","Economy","Environment - Biodiversity & GI","Environment - HE","Environment - Townscape","Environment - Pollution","Climate Change","Infrastructure and Community","Transport and Movement","City Centre"],"not_rendered":{"charts":0,"images":1,"macros":0,"external_links":0,"defined_names":2,"comments":0,"pivot_tables":0},"unopened":[],"bounds":{"document_bytes":16777216,"sheet_cells":100000,"rows_first":2000,"rows_last":500,"rows_between":2000,"halvings":0,"cell_chars":16384,"cell_head_chars":4096},"cells_cut":0,"cells_raw":0,"read":"whole","date_system":"1900"}

{"sheet":"Front Page","index":0,"n_rows":24,"n_cols":11,"rows_kept":24,"cut":false,"hidden":false,"merged":[[7,2,8,10]]}
[]
[]
[]
[]
[]
[]
{"$rows_left_out":19}
{"sheet":"Disclaimer","index":1,"n_rows":38,"n_cols":7,"rows_kept":38,"cut":false,"hidden":false,"merged":[[37,1,37,2],[37,6,37,7],[38,1,38,2],[38,6,38,7],[39,1,39,2],[39,6,39,7],[10,4,10,6],[19,2,32,6],[35,1,35,2],[35,6,35,7],[36,1,36,2],[36,6,36,7]]}
[]
[]
[]
[]
[null,null,null,"Contract  No:"]
[]
{"$rows_left_out":33}
{"sheet":"Methodology","index":2,"n_rows":19,"n_cols":12,"rows_kept":19,"cut":false,"hidden":false,"merged":[[9,2,9,6],[2,1,2,2],[3,1,3,2],[4,1,4,2],[5,1,5,2],[7,0,7,1],[7,2,7,11],[16,0,16,12],[17,0,17,12],[18,0,18,12],[11,0,11,12],[12,0,12,12],[13,0,13,12],[14,0,14,12],[15,0,15,12]]}
["The methodology used for the assessment of all policies is outlined below, with an explanation given under each header. The same assessment matrices has been used for the assessment of all policies, hence all follow the same format. "]
[]
["Policy Group"]
["Policies"]
["Policy/alternative description"]
["Assumptions Made"]
{"$rows_left_out":14}
{"sheet":"Significance Description","index":3,"n_rows":23,"n_cols":10,"rows_kept":23,"cut":false,"hidden":false,"merged":[[2,1,2,2],[2,7,2,9],[4,7,11,7],[4,8,11,8],[4,9,11,9],[7,1,11,1],[16,1,19,1],[22,7,27,7],[22,8,27,8],[22,9,27,9],[12,7,18,7],[12,8,18,8],[12,9,18,9],[12,1,15,1]]}
[]
[]
[null,"Nature of effects",null,null,null,null,null,"Significance Scores"]
[null,"Criterion","Description",null,null,null,null,"Symbol","Definitions of Significance of Effects Against the SA Objectives","Assumptions on the nature of effects"]
[null,"Significance ","An assessment of the significance of the potential effects identified. This could be a positive effect, negative effect, neutral effect, significant positive effect or significant negative effect. The definitions for these effects are detailed to the right.",null,null,null,null,"++","Significant Positive Effect: the policy option supports the achievement of this objective; it addresses all relevant assessment questions and could result in a potentially significant beneficial effect e.g. improved access by walking and cycling modes to a local or town centre","Permanent\nContinual\nMagnitude: High 80%+ receptor or environmental capacity affected; or Medium 40-80% of receptor or environmental capacity of affected\nThe effect could be to:\n•\tenhance and redefine the location in a positive manner, making a contribution at a national or international scale; \n•\trepair or restore receptors badly damaged or degraded through previous uses; and/or \n•\timprove one or more key elements/features/ characteristics of a receptor with recognised quality such as a specific regional or national designation."]
[null,"Permanent/temporary","An assessment of whether the predicted effects would be permanent (P), or temporary (T). "]
{"$rows_left_out":18}
{"sheet":"Summary","index":4,"n_rows":13,"n_cols":22,"rows_kept":13,"cut":false,"hidden":false,"merged":[[1,20,1,21]]}
[]
[null,"Policy Group","SA1","SA2","SA3","SA4","SA5","SA6","SA7","SA8","SA9","SA10","SA11","SA12","SA13","SA14","SA15","SA16","SA17",null,"Key"]
[null,"General Development Principles",{"$f":"IFERROR(VLOOKUP('General Development Principles'!H7, Summary!$U:$V, 2, FALSE), \"\")","v":"+ +"},{"$f":"IFERROR(VLOOKUP('General Development Principles'!H8, Summary!$U:$V, 2, FALSE), \"\")","v":"+ +"},{"$f":"IFERROR(VLOOKUP('General Development Principles'!H9, Summary!$U:$V, 2, FALSE), \"\")","v":"+"},{"$f":"IFERROR(VLOOKUP('General Development Principles'!H10, Summary!$U:$V, 2, FALSE), \"\")","v":0},{"$f":"IFERROR(VLOOKUP('General Development Principles'!H11, Summary!$U:$V, 2, FALSE), \"\")","v":"+ +"},{"$f":"IFERROR(VLOOKUP('General Development Principles'!H12, Summary!$U:$V, 2, FALSE), \"\")","v":"+ +"},{"$f":"IFERROR(VLOOKUP('General Development Principles'!H13, Summary!$U:$V, 2, FALSE), \"\")","v":"+ +"},{"$f":"IFERROR(VLOOKUP('General Development Principles'!H14, Summary!$U:$V, 2, FALSE), \"\")","v":"+"},{"$f":"IFERROR(VLOOKUP('General Development Principles'!H15, Summary!$U:$V, 2, FALSE), \"\")","v":"+ +"},{"$f":"IFERROR(VLOOKUP('General Development Principles'!H16, Summary!$U:$V, 2, FALSE), \"\")","v":"+ +"},{"$f":"IFERROR(VLOOKUP('General Development Principles'!H17, Summary!$U:$V, 2, FALSE), \"\")","v":"+"},{"$f":"IFERROR(VLOOKUP('General Development Principles'!H18, Summary!$U:$V, 2, FALSE), \"\")","v":"+"},{"$f":"IFERROR(VLOOKUP('General Development Principles'!H19, Summary!$U:$V, 2, FALSE), \"\")","v":"+ +"},{"$f":"IFERROR(VLOOKUP('General Development Principles'!H20, Summary!$U:$V, 2, FALSE), \"\")","v":"+"},{"$f":"IFERROR(VLOOKUP('General Development Principles'!H21, Summary!$U:$V, 2, FALSE), \"\")","v":"+ +"},{"$f":"IFERROR(VLOOKUP('General Development Principles'!H22, Summary!$U:$V, 2, FALSE), \"\")","v":"+"},{"$f":"IFERROR(VLOOKUP('General Development Principles'!H23, Summary!$U:$V, 2, FALSE), \"\")","v":"+"},null,"Significant positive","+ +"]
[null,"Housing",{"$f":"IFERROR(VLOOKUP(Housing!H7, Summary!$U:$V, 2, FALSE), \"\")","v":"+ +"},{"$f":"IFERROR(VLOOKUP(Housing!H8, Summary!$U:$V, 2, FALSE), \"\")","v":"+"},{"$f":"IFERROR(VLOOKUP(Housing!H9, Summary!$U:$V, 2, FALSE), \"\")","v":0},{"$f":"IFERROR(VLOOKUP(Housing!H10, Summary!$U:$V, 2, FALSE), \"\")","v":0},{"$f":"IFERROR(VLOOKUP(Housing!H11, Summary!$U:$V, 2, FALSE), \"\")","v":"+"},{"$f":"IFERROR(VLOOKUP(Housing!H12, Summary!$U:$V, 2, FALSE), \"\")","v":"+ +"},{"$f":"IFERROR(VLOOKUP(Housing!H13, Summary!$U:$V, 2, FALSE), \"\")","v":"+"},{"$f":"IFERROR(VLOOKUP(Housing!H14, Summary!$U:$V, 2, FALSE), \"\")","v":"?"},{"$f":"IFERROR(VLOOKUP(Housing!H15, Summary!$U:$V, 2, FALSE), \"\")","v":"+ +"},{"$f":"IFERROR(VLOOKUP(Housing!H16, Summary!$U:$V, 2, FALSE), \"\")","v":"-"},{"$f":"IFERROR(VLOOKUP(Housing!H17, Summary!$U:$V, 2, FALSE), \"\")","v":"-"},{"$f":"IFERROR(VLOOKUP(Housing!H18, Summary!$U:$V, 2, FALSE), \"\")","v":0},{"$f":"IFERROR(VLOOKUP(Housing!H19, Summary!$U:$V, 2, FALSE), \"\")","v":"+"},{"$f":"IFERROR(VLOOKUP(Housing!H20, Summary!$U:$V, 2, FALSE), \"\")","v":"?"},{"$f":"IFERROR(VLOOKUP(Housing!H21, Summary!$U:$V, 2, FALSE), \"\")","v":"?"},{"$f":"IFERROR(VLOOKUP(Housing!H22, Summary!$U:$V, 2, FALSE), \"\")","v":"+"},{"$f":"IFERROR(VLOOKUP(Housing!H23, Summary!$U:$V, 2, FALSE), \"\")","v":"?"},null,"Minor Positive","+"]
[null,"Economy",{"$f":"IFERROR(VLOOKUP(Economy!H7, Summary!$U:$V, 2, FALSE), \"\")","v":"+"},{"$f":"IFERROR(VLOOKUP(Economy!H8, Summary!$U:$V, 2, FALSE), \"\")","v":"+"},{"$f":"IFERROR(VLOOKUP(Economy!H9, Summary!$U:$V, 2, FALSE), \"\")","v":"+ +"},{"$f":"IFERROR(VLOOKUP(Economy!H10, Summary!$U:$V, 2, FALSE), \"\")","v":"+ +"},{"$f":"IFERROR(VLOOKUP(Economy!H11, Summary!$U:$V, 2, FALSE), \"\")","v":"+"},{"$f":"IFERROR(VLOOKUP(Economy!H12, Summary!$U:$V, 2, FALSE), \"\")","v":0},{"$f":"IFERROR(VLOOKUP(Economy!H13, Summary!$U:$V, 2, FALSE), \"\")","v":"+"},{"$f":"IFERROR(VLOOKUP(Economy!H14, Summary!$U:$V, 2, FALSE), \"\")","v":"?"},{"$f":"IFERROR(VLOOKUP(Economy!H15, Summary!$U:$V, 2, FALSE), \"\")","v":"+"},{"$f":"IFERROR(VLOOKUP(Economy!H16, Summary!$U:$V, 2, FALSE), \"\")","v":"+"},{"$f":"IFERROR(VLOOKUP(Economy!H17, Summary!$U:$V, 2, FALSE), \"\")","v":0},{"$f":"IFERROR(VLOOKUP(Economy!H18, Summary!$U:$V, 2, FALSE), \"\")","v":"?"},{"$f":"IFERROR(VLOOKUP(Economy!H19, Summary!$U:$V, 2, FALSE), \"\")","v":0},{"$f":"IFERROR(VLOOKUP(Economy!H20, Summary!$U:$V, 2, FALSE), \"\")","v":"?"},{"$f":"IFERROR(VLOOKUP(Economy!H21, Summary!$U:$V, 2, FALSE), \"\")","v":"?"},{"$f":"IFERROR(VLOOKUP(Economy!H22, Summary!$U:$V, 2, FALSE), \"\")","v":"+"},{"$f":"IFERROR(VLOOKUP(Economy!H23, Summary!$U:$V, 2, FALSE), \"\")","v":"?"},null,"Neutral",0]
[null,"Environment - Biodiversity & GI",{"$f":"IFERROR(VLOOKUP('Environment - Biodiversity & GI'!H7, Summary!$U:$V, 2, FALSE), \"\")","v":"+ +"},{"$f":"IFERROR(VLOOKUP('Environment - Biodiversity & GI'!H8, Summary!$U:$V, 2, FALSE), \"\")","v":"+ +"},{"$f":"IFERROR(VLOOKUP('Environment - Biodiversity & GI'!H9, Summary!$U:$V, 2, FALSE), \"\")","v":0},{"$f":"IFERROR(VLOOKUP('Environment - Biodiversity & GI'!H10, Summary!$U:$V, 2, FALSE), \"\")","v":0},{"$f":"IFERROR(VLOOKUP('Environment - Biodiversity & GI'!H11, Summary!$U:$V, 2, FALSE), \"\")","v":"?"},{"$f":"IFERROR(VLOOKUP('Environment - Biodiversity & GI'!H12, Summary!$U:$V, 2, FALSE), \"\")","v":0},{"$f":"IFERROR(VLOOKUP('Environment - Biodiversity & GI'!H13, Summary!$U:$V, 2, FALSE), \"\")","v":"+ +"},{"$f":"IFERROR(VLOOKUP('Environment - Biodiversity & GI'!H14, Summary!$U:$V, 2, FALSE), \"\")","v":"+ +"},{"$f":"IFERROR(VLOOKUP('Environment - Biodiversity & GI'!H15, Summary!$U:$V, 2, FALSE), \"\")","v":"+ +"},{"$f":"IFERROR(VLOOKUP('Environment - Biodiversity & GI'!H16, Summary!$U:$V, 2, FALSE), \"\")","v":"+"},{"$f":"IFERROR(VLOOKUP('Environment - Biodiversity & GI'!H17, Summary!$U:$V, 2, FALSE), \"\")","v":"+"},{"$f":"IFERROR(VLOOKUP('Environment - Biodiversity & GI'!H18, Summary!$U:$V, 2, FALSE), \"\")","v":"+ +"},{"$f":"IFERROR(VLOOKUP('Environment - Biodiversity & GI'!H19, Summary!$U:$V, 2, FALSE), \"\")","v":"+ +"},{"$f":"IFERROR(VLOOKUP('Environment - Biodiversity & GI'!H20, Summary!$U:$V, 2, FALSE), \"\")","v":"+"},{"$f":"IFERROR(VLOOKUP('Environment - Biodiversity & GI'!H21, Summary!$U:$V, 2, FALSE), \"\")","v":0},{"$f":"IFERROR(VLOOKUP('Environment - Biodiversity & GI'!H22, Summary!$U:$V, 2, FALSE), \"\")","v":"?"},{"$f":"IFERROR(VLOOKUP('Environment - Biodiversity & GI'!H23, Summary!$U:$V, 2, FALSE), \"\")","v":0},null,"Minor Negative","-"]
{"$rows_left_out":8}
{"sheet":"Spatial_Strategy_Policies","index":5,"n_rows":22,"n_cols":13,"rows_kept":22,"cut":false,"hidden":true,"merged":[[0,2,0,3],[1,2,1,3],[2,2,2,3],[4,0,4,2],[4,3,4,12]]}
["Policy/Alternative name",null,"Spatial Strategy Policy 1: Overall Objectives\nSpatial Strategy 2: Making Effective Use of Land and Resources"]
["Chapter",null,"Design\n"]
["Policy/alternative description"]
[]
["SA Framework",null,null,"SA Policy Assessment"]
["SA objective","SA","SA sub-objective","Direct/\nIndirect","Magnitude","Duration","Spatial Extent","Permanence/ Reversibility","Significance","Description of potential effects","Potential for cumulative effects? ","Mitigation","Enhancements"]
{"$rows_left_out":17}
{"sheet":"General Development Principles","index":6,"n_rows":23,"n_cols":12,"rows_kept":23,"cut":false,"hidden":false,"merged":[[4,0,4,1],[4,2,4,11],[0,1,0,6],[1,1,1,6],[2,1,2,6]]}
["Policy Group","General Development Principles"]
["Policies ","GD1: Placemaking Principles\nGD2: Character and Context\nGD3: Amenity\nGD4: Accessible Places\nGD5: Resilient Places and Community Safety\nGD6: Health and Wellbeing\nGD7: Comprehensive and Coordinated Development\nGD8: Enforcement\nGD9: Infrastructure and Developer Contribution"]
["Policy/alternative description"]
[]
["SA Framework",null,"SA Policy Assessment"]
["SA objective","Supporting Questions","Direct/\nIndirect","Magnitude","Duration","Spatial Extent","Permanence/ Reversibility","Significance","Description of potential effects","Potential for cumulative effects? ","Mitigation","Enhancements"]
{"$rows_left_out":18}
{"sheet":"Housing","index":7,"n_rows":23,"n_cols":12,"rows_kept":23,"cut":false,"hidden":false,"merged":[[0,1,0,6],[1,1,1,6],[2,1,2,6],[4,0,4,1],[4,2,4,11]]}
["Policy Group","Housing"]
["Policies ","H1: Housing Delivery\nH2: Residential Development - General Criteria\nH3: Housing Extensions\nH4: Affordable Housing\nH5: Looked After Children\nH6: Accommodation for Older People and People with Disabilities\nH7: Proposals Which Would Create and New House in Multiple Occupation\nH8: Student Accommodation\nH9: Self-Build, Custom Build and Community Build Homes\nH10: Gypsies, Travellers and Travelling Showpeople"]
["Policy/alternative description"]
[]
["SA Framework",null,"SA Policy Assessment"]
["SA objective","Supporting Questions","Direct/\nIndirect","Magnitude","Duration","Spatial Extent","Permanence/ Reversibility","Significance","Description of potential effects","Potential for cumulative effects? ","Mitigation","Enhancements"]
{"$rows_left_out":18}
{"sheet":"Economy","index":8,"n_rows":23,"n_cols":12,"rows_kept":23,"cut":false,"hidden":false,"merged":[[0,1,0,6],[1,1,1,6],[2,1,2,6],[4,0,4,1],[4,2,4,11]]}
["Policy Group","Economy"]
["Policies ","E1: New Employment Locations\nE2: Existing Employment Locations\nE3: Local Labour Agreements\nE4: Office Development\nE8: Defined Centres\nE9: Main Town Centre Uses Outside of Centres\nE10: Tourism and Culture\nE11: Managing the Proliferation of Specific In-Centre Uses"]
["Policy/alternative description"]
[]
["SA Framework",null,"SA Policy Assessment"]
["SA objective","Supporting Questions","Direct/\nIndirect","Magnitude","Duration","Spatial Extent","Permanence/ Reversibility","Significance","Description of potential effects","Potential for cumulative effects? ","Mitigation","Enhancements"]
{"$rows_left_out":18}
{"sheet":"Environment - Biodiversity & GI","index":9,"n_rows":23,"n_cols":12,"rows_kept":23,"cut":false,"hidden":false,"merged":[[0,1,0,6],[1,1,1,6],[2,1,2,6],[4,0,4,1],[4,2,4,11]]}
["Policy Group","Environment - Biodiversity and Green Infrastructure"]
["Policies ","EN1: Green and Blue Infrastructure\nEN2: Dark Infrastructure\nEN3: Open Space, Sport and Recreation Buildings\nEN4: Allotments and Community Gardens\nEN5: Green Belt\nEN6: Green Wedges\nEN7: Green Gaps\nEN8: Biodiversity and Geodiversity\nEN9: Trees and Hedgerows\nEN10: Biodiversity Net Gain"]
["Policy/alternative description"]
[]
["SA Framework",null,"SA Policy Assessment"]
["SA objective","Supporting Questions","Direct/\nIndirect","Magnitude","Duration","Spatial Extent","Permanence/ Reversibility","Significance","Description of potential effects","Potential for cumulative effects? ","Mitigation","Enhancements"]
{"$rows_left_out":18}
{"sheet":"Environment - HE","index":10,"n_rows":23,"n_cols":12,"rows_kept":23,"cut":false,"hidden":false,"merged":[[0,1,0,6],[1,1,1,6],[2,1,2,6],[4,0,4,1],[4,2,4,11]]}
["Policy Group","Environment - Historic Environment"]
["Policies ","EN11: Historic Environment\nEN12: Derwent Valley Mills World Heritage Site\nEN13: Darley Abbey Mills Complex\nEN14: Conservation Areas\nEN15: Listed Buildings and Locally Listed Buildings\nEN16: Heritage Statements of Significance\nEN17: Uses Within Buildings of Architectural or Historic Importance\nEN18: Archaeology\nEN19: Historic Parks and Gardens and Designated Landscapes"]
["Policy/alternative description"]
[]
["SA Framework",null,"SA Policy Assessment"]
["SA objective","Supporting Questions","Direct/\nIndirect","Magnitude","Duration","Spatial Extent","Permanence/ Reversibility","Significance","Description of potential effects","Potential for cumulative effects? ","Mitigation","Enhancements"]
{"$rows_left_out":18}
{"sheet":"Environment - Townscape","index":11,"n_rows":23,"n_cols":12,"rows_kept":23,"cut":false,"hidden":false,"merged":[[0,1,0,6],[1,1,1,6],[2,1,2,6],[4,0,4,1],[4,2,4,11]]}
["Policy Group","Environment - Townscape"]
["Policies ","EN20: Advertisements\nEN21: Shopfronts"]
["Policy/alternative description"]
[]
["SA Framework",null,"SA Policy Assessment"]
["SA objective","Supporting Questions","Direct/\nIndirect","Magnitude","Duration","Spatial Extent","Permanence/ Reversibility","Significance","Description of potential effects","Potential for cumulative effects? ","Mitigation","Enhancements"]
{"$rows_left_out":18}
{"sheet":"Environment - Pollution","index":12,"n_rows":23,"n_cols":12,"rows_kept":23,"cut":false,"hidden":false,"merged":[[0,1,0,6],[1,1,1,6],[2,1,2,6],[4,0,4,1],[4,2,4,11]]}
["Policy Group","Environment - Pollution"]
["Policies ","EN22: Air Quality\nEN23: Land Contamination\nEN24: Pollution"]
["Policy/alternative description"]
[]
["SA Framework",null,"SA Policy Assessment"]
["SA objective","Supporting Questions","Direct/\nIndirect","Magnitude","Duration","Spatial Extent","Permanence/ Reversibility","Significance","Description of potential effects","Potential for cumulative effects? ","Mitigation","Enhancements"]
{"$rows_left_out":18}
{"sheet":"Climate Change","index":13,"n_rows":23,"n_cols":12,"rows_kept":23,"cut":false,"hidden":false,"merged":[[0,1,0,6],[1,1,1,6],[2,1,2,6],[4,0,4,1],[4,2,4,11]]}
["Policy Group","Climate Change"]
["Policies ","CL1: Flood Risk and Water Management\nCL2: Our City Our River\nCL3: Sustainable Design and Construction\nCL4: Renewable and Low Carbon Energy\nCL5: Embodied Carbon"]
["Policy/alternative description"]
[]
["SA Framework",null,"SA Policy Assessment"]
["SA objective","Supporting Questions","Direct/\nIndirect","Magnitude","Duration","Spatial Extent","Permanence/ Reversibility","Significance","Description of potential effects","Potential for cumulative effects? ","Mitigation","Enhancements"]
{"$rows_left_out":18}
{"sheet":"Infrastructure and Community","index":14,"n_rows":23,"n_cols":12,"rows_kept":23,"cut":false,"hidden":false,"merged":[[0,1,0,6],[1,1,1,6],[2,1,2,6],[4,0,4,1],[4,2,4,11]]}
["Policy Group","Infrastructure and Community"]
["Policies ","IC1: Social and Community Facilities\nIC2: Cemetery\nIC3: Education Provision\nIC4: Higher and Further Education\nIC5: Communication Infrastructure"]
["Policy/alternative description"]
[]
["SA Framework",null,"SA Policy Assessment"]
["SA objective","Supporting Questions","Direct/\nIndirect","Magnitude","Duration","Spatial Extent","Permanence/ Reversibility","Significance","Description of potential effects","Potential for cumulative effects? ","Mitigation","Enhancements"]
{"$rows_left_out":18}
{"sheet":"Transport and Movement","index":15,"n_rows":23,"n_cols":12,"rows_kept":23,"cut":false,"hidden":false,"merged":[[0,1,0,6],[1,1,1,6],[2,1,2,6],[4,0,4,1],[4,2,4,11]]}
["Policy Group","Transport and Movement"]
["Policies ","T1: Active and Sustainable Transport\nT2: Transport Infrastructure\nT3: Servicing, Accessibility and Parking\nT4: Protected Routes\nT5: Electric Vehicle Charging Facilities\nT6: Transport Mobility Hubs\nT7: Safeguarded Areas around Aerodromes (East Midlands Airport)"]
["Policy/alternative description"]
[]
["SA Framework",null,"SA Policy Assessment"]
["SA objective","Supporting Questions","Direct/\nIndirect","Magnitude","Duration","Spatial Extent","Permanence/ Reversibility","Significance","Description of potential effects","Potential for cumulative effects? ","Mitigation","Enhancements"]
{"$rows_left_out":18}
{"sheet":"City Centre","index":16,"n_rows":23,"n_cols":12,"rows_kept":23,"cut":false,"hidden":false,"merged":[[0,1,0,6],[1,1,1,6],[2,1,2,6],[4,0,4,1],[4,2,4,11]]}
["Policy Group","City Centre"]
["Policies ","CC1: City Centre Strategy\nCC2: Defining the City Centre\nCC3: City Centre Living\nCC4: Residential led, Mixed Use Site Allocations\nCC5: Non-residential Regeneration Opportunities\nCC6: Tall Buildings\nCC7: Businesses, Creativity and Learning\nCC8: Shopping, Eating and Drinking\nCC9: Active and Inclusive Frontages\nCC10: Streets and Spaces\nCC11: City Centre Quiet Zone"]
["Policy/alternative description"]
[]
["SA Framework",null,"SA Policy Assessment"]
["SA objective","Supporting Questions","Direct/\nIndirect","Magnitude","Duration","Spatial Extent","Permanence/ Reversibility","Significance","Description of potential effects","Potential for cumulative effects? ","Mitigation","Enhancements"]
{"$rows_left_out":17}