{"text_format":"1","workbook":"xlsx","n_sheets":32,"sheets":["Front Page","Disclaimer","Methodology","RAG","Significance Description","Summary","HA1","HA2","HA3","HA4","HA5","HA6","HA7","HA8","HA9","HA10","HA11","HA12","HA13","HA14","HA15","HA16","HA17","CC4","CC5","CC12","CC13","CC14","CC15","E5","E6","E7"],"not_rendered":{"charts":0,"images":1,"macros":0,"external_links":0,"defined_names":1,"comments":0,"pivot_tables":0},"unopened":[],"bounds":{"document_bytes":16777216,"sheet_cells":100000,"rows_first":2000,"rows_last":500,"rows_between":2000,"halvings":0,"cell_chars":16384,"cell_head_chars":4096},"cells_cut":0,"cells_raw":0,"read":"whole","date_system":"1900"}

{"sheet":"Front Page","index":0,"n_rows":30,"n_cols":11,"rows_kept":30,"cut":false,"hidden":false,"merged":[[7,2,8,10]]}
[]
[]
[]
[]
[]
[]
[]
[]
{"$rows_left_out":23}
{"sheet":"Disclaimer","index":1,"n_rows":38,"n_cols":7,"rows_kept":38,"cut":false,"hidden":false,"merged":[[10,4,10,6],[19,2,32,6],[35,1,35,2],[35,6,35,7],[36,1,36,2],[36,6,36,7],[37,1,37,2],[37,6,37,7],[38,1,38,2],[38,6,38,7],[39,1,39,2],[39,6,39,7]]}
[]
[]
[]
[]
[null,null,null,"Contract  No:"]
[]
[]
[null,null,null,"Issue",2]
{"$rows_left_out":31}
{"sheet":"Methodology","index":2,"n_rows":14,"n_cols":16,"rows_kept":14,"cut":false,"hidden":false,"merged":[[13,2,13,5],[2,1,2,6],[3,1,3,6],[4,1,4,6],[9,1,9,6],[11,0,11,1],[11,6,11,15],[11,2,11,5],[13,6,13,10]]}
["The methodology used for the assessment of all sites is outlined below, with an explanation given under each header. The same assessment matrices has been used for the assessment of all sites, hence all follow the same format. "]
[]
["Site Name"]
["Site Address"]
["Town/Locality"]
["Est Housing Yield/Employment Space"]
["Site Area (ha)"]
["Site Description"]
{"$rows_left_out":7}
{"sheet":"RAG","index":3,"n_rows":48,"n_cols":50,"rows_kept":48,"cut":false,"hidden":false,"merged":[[2,5,2,7],[2,8,2,12],[2,13,2,14],[2,15,2,17],[2,20,2,22],[2,43,2,45],[2,46,2,48],[2,23,2,24],[2,25,2,26],[2,27,2,33],[2,35,2,38],[2,39,2,42]]}
[]
[]
[null,"Acronym","Indicator",null,null,"SA1",null,null,"SA2",null,null,null,null,"SA3",null,"SA4",null,null,"SA5","SA6","SA7",null,null,"SA8",null,"SA9",null,"SA10",null,null,null,null,null,null,"SA11","SA12",null,null,null,"SA13",null,null,null,"SA15",null,null,"SA16",null,null,"SA17"]
[null,"SA1_IMD","IMD Overall Deprivation (LSOA)",null,"Option","SA1_IMD","SA1_PSch","SA1_SSch","SA2_IMD","SA2_HCP","SA2_ALT","SA2_CC","SA2_POS","SA3_PSA","SA3_TC","SA4_IMDE","SA4_IMDI","SA4_EEA","SA5_IMDC","SA6_IMDH","SA7_POS","SA7_CS","SA7_SF","SA8_LNR","SA8_SSSI","SA9_GB","SA9_GW","SA10_LB","SA10_RPG","SA10_SM","SA10_CA","SA10_AAA","SA10_HAR","SA10_WHS","SA11_AQMA","SA12_WB","SA12_FZ2","SA12_FZ3a","SA12_FZ3b","SA13_FD","SA13_FZ2","SA13_FZ3a","SA13_FZ3b","SA15_TS","SA15_BS","SA15_CN","SA16_ALC","SA16_SPZ","SA16_MS","SA17_WS"]
[null,"SA1_PSch","Primary Schools",null,"HA1: Rykneld Road, Littleover","Amber","Green","Green","Amber","Red","Red","Red","Green","Red","Green","Amber","Amber","Red","Amber","Amber","Green","Green","Red","Green","Green","Green","Green","Green","Green","Green","Green","Green","Green","Green","Green","Red","Red","Red","Green","Green","Red","Red","Green","Red","Green","Red","Amber","Green","Green","Green"]
[null,"SA1_SSch","Secondary Schools",null,"HA2: Brook Farm, Chaddesden","Amber","Green","Green","Red","Green","Green","Green","Green","Red","Green","Red","Red","Red","Red","Amber","Green","Green","Green","Amber","Green","Red","Red","Red","Green","Green","Green","Green","Green","Green","Green","Red","Red","Red","Green","Green","Red","Red","Green","Red","Amber","Red","Amber","Green","Green","Green"]
[null,"SA2_IMD","IMD Health Deprivation (LSOA)",null,"HA3: East of Moorway Lane, Littleover","Green","Green","Green","Red","Red","Red","Red","Green","Red","Green","Red","Red","Red","Amber","Amber","Green","Green","Green","Amber","Green","Green","Red","Green","Green","Green","Green","Green","Green","Green","Green","Red","Red","Red","Red","Green","Red","Red","Red","Red","Amber","Red","Amber","Green","Green","Green"]
[null,"SA2_HCP","Healthcare provision (GP, Dentists, Pharmacies)",null,"HA4: Royal Hill Road, Spondon","Green","Green","Green","Amber","Green","Green","Red","Green","Red","Green","Amber","Green","Red","Amber","Green","Green","Green","Green","Amber","Green","Green","Red","Amber","Green","Green","Green","Green","Green","Green","Green","Red","Red","Red","Green","Green","Red","Red","Green","Red","Amber","Red","Amber","Green","Green","Green"]
{"$rows_left_out":41}
{"sheet":"Significance Description","index":4,"n_rows":30,"n_cols":10,"rows_kept":30,"cut":false,"hidden":false,"merged":[[2,1,2,2],[2,7,2,9],[4,7,12,7],[4,8,12,8],[4,9,12,9],[7,1,11,1],[12,1,15,1],[13,7,19,7],[13,8,19,8],[13,9,19,9],[16,1,19,1],[23,7,28,7],[23,8,28,8],[23,9,28,9],[29,7,38,7],[29,8,38,8],[29,9,38,9]]}
[]
[]
[null,"Nature of effects",null,null,null,null,null,"Significance Scores"]
[null,"Criterion","Description",null,null,null,null,"Symbol","Definitions of Significance of Effects Against the SA Objectives","Assumptions on the nature of effects"]
[null,"Significance ","An assessment of the significance of the potential effects identified. This could be a positive effect, negative effect, neutral effect, significant positive effect or significant negative effect. The definitions for these effects are detailed to the right.",null,null,null,null,"++","Significant Positive Effect: the policy option supports the achievement of this objective; it addresses all relevant assessment questions and could result in a potentially significant beneficial effect e.g. improved access by walking and cycling modes to a local or town centre","Permanent\nContinual\nMagnitude: High 80%+ receptor or environmental capacity affected; or Medium 40-80% of receptor or environmental capacity of affected\nThe effect could be to:\n•\tenhance and redefine the location in a positive manner, making a contribution at a national or international scale; \n•\trepair or restore receptors badly damaged or degraded through previous uses; and/or \n•\timprove one or more key elements/features/ characteristics of a receptor with recognised quality such as a specific regional or national designation."]
[null,"Permanent/temporary","An assessment of whether the predicted effects would be permanent (P), or temporary (T). "]
[null,"Reversible/Irreversible","An assessment of whether or not the identified effect can be reversed (R) e.g. the loss of greenfield land to development would be irreversible (I). "]
[null,"Spatial extent","How far the effect is predicted to be spread geographically: "]
{"$rows_left_out":23}
{"sheet":"Summary","index":5,"n_rows":29,"n_cols":22,"rows_kept":29,"cut":false,"hidden":false,"merged":[[2,20,2,21]]}
[]
[]
[null,"Site","SA1","SA2","SA3","SA4","SA5","SA6","SA7","SA8","SA9","SA10","SA11","SA12","SA13","SA14","SA15","SA16","SA17",null,"Key"]
[null,"HA1",{"$f":"IFERROR(VLOOKUP('HA1'!$L$12, Summary!$U:$V, 2, FALSE), \"\")","v":"+ +"},{"$f":"IFERROR(VLOOKUP('HA1'!$L$13, Summary!$U:$V, 2, FALSE), \"\")","v":"+ +"},{"$f":"IFERROR(VLOOKUP('HA1'!$L$14, Summary!$U:$V, 2, FALSE), \"\")","v":"+ +"},{"$f":"IFERROR(VLOOKUP('HA1'!$L$15, Summary!$U:$V, 2, FALSE), \"\")","v":"+"},{"$f":"IFERROR(VLOOKUP('HA1'!$L$16, Summary!$U:$V, 2, FALSE), \"\")","v":"+"},{"$f":"IFERROR(VLOOKUP('HA1'!$L$17, Summary!$U:$V, 2, FALSE), \"\")","v":"+ +"},{"$f":"IFERROR(VLOOKUP('HA1'!$L$18, Summary!$U:$V, 2, FALSE), \"\")","v":"+"},{"$f":"IFERROR(VLOOKUP('HA1'!$L$19, Summary!$U:$V, 2, FALSE), \"\")","v":"+"},{"$f":"IFERROR(VLOOKUP('HA1'!$L$20, Summary!$U:$V, 2, FALSE), \"\")","v":"?"},{"$f":"IFERROR(VLOOKUP('HA1'!$L$21, Summary!$U:$V, 2, FALSE), \"\")","v":0},{"$f":"IFERROR(VLOOKUP('HA1'!$L$22, Summary!$U:$V, 2, FALSE), \"\")","v":0},{"$f":"IFERROR(VLOOKUP('HA1'!$L$23, Summary!$U:$V, 2, FALSE), \"\")","v":"-"},{"$f":"IFERROR(VLOOKUP('HA1'!$L$24, Summary!$U:$V, 2, FALSE), \"\")","v":"-"},{"$f":"IFERROR(VLOOKUP('HA1'!$L$25, Summary!$U:$V, 2, FALSE), \"\")","v":"-"},{"$f":"IFERROR(VLOOKUP('HA1'!$L$26, Summary!$U:$V, 2, FALSE), \"\")","v":"+"},{"$f":"IFERROR(VLOOKUP('HA1'!$L$27, Summary!$U:$V, 2, FALSE), \"\")","v":"- -"},{"$f":"IFERROR(VLOOKUP('HA1'!$L$28, Summary!$U:$V, 2, FALSE), \"\")","v":"-"},null,"Significant positive","+ +"]
[null,"HA2",{"$f":"IFERROR(VLOOKUP('HA2'!$L$12, Summary!$U:$V, 2, FALSE), \"\")","v":"+"},{"$f":"IFERROR(VLOOKUP('HA2'!$L$13, Summary!$U:$V, 2, FALSE), \"\")","v":"+"},{"$f":"IFERROR(VLOOKUP('HA2'!$L$14, Summary!$U:$V, 2, FALSE), \"\")","v":"+"},{"$f":"IFERROR(VLOOKUP('HA2'!$L$15, Summary!$U:$V, 2, FALSE), \"\")","v":"-"},{"$f":"IFERROR(VLOOKUP('HA2'!$L$16, Summary!$U:$V, 2, FALSE), \"\")","v":"?"},{"$f":"IFERROR(VLOOKUP('HA2'!$L$17, Summary!$U:$V, 2, FALSE), \"\")","v":"+ +"},{"$f":"IFERROR(VLOOKUP('HA2'!$L$18, Summary!$U:$V, 2, FALSE), \"\")","v":"+ +"},{"$f":"IFERROR(VLOOKUP('HA2'!$L$19, Summary!$U:$V, 2, FALSE), \"\")","v":"+"},{"$f":"IFERROR(VLOOKUP('HA2'!$L$20, Summary!$U:$V, 2, FALSE), \"\")","v":"-"},{"$f":"IFERROR(VLOOKUP('HA2'!$L$21, Summary!$U:$V, 2, FALSE), \"\")","v":0},{"$f":"IFERROR(VLOOKUP('HA2'!$L$22, Summary!$U:$V, 2, FALSE), \"\")","v":"-"},{"$f":"IFERROR(VLOOKUP('HA2'!$L$23, Summary!$U:$V, 2, FALSE), \"\")","v":"-"},{"$f":"IFERROR(VLOOKUP('HA2'!$L$24, Summary!$U:$V, 2, FALSE), \"\")","v":"-"},{"$f":"IFERROR(VLOOKUP('HA2'!$L$25, Summary!$U:$V, 2, FALSE), \"\")","v":"-"},{"$f":"IFERROR(VLOOKUP('HA2'!$L$26, Summary!$U:$V, 2, FALSE), \"\")","v":"- -"},{"$f":"IFERROR(VLOOKUP('HA2'!$L$27, Summary!$U:$V, 2, FALSE), \"\")","v":"- -"},{"$f":"IFERROR(VLOOKUP('HA2'!$L$28, Summary!$U:$V, 2, FALSE), \"\")","v":"-"},null,"Minor Positive","+"]
[null,"HA3",{"$f":"IFERROR(VLOOKUP('HA3'!$L$10, Summary!$U:$V, 2, FALSE), \"\")","v":"+ +"},{"$f":"IFERROR(VLOOKUP('HA3'!$L$11, Summary!$U:$V, 2, FALSE), \"\")","v":"+ +"},{"$f":"IFERROR(VLOOKUP('HA3'!$L$12, Summary!$U:$V, 2, FALSE), \"\")","v":"+"},{"$f":"IFERROR(VLOOKUP('HA3'!$L$13, Summary!$U:$V, 2, FALSE), \"\")","v":"+"},{"$f":"IFERROR(VLOOKUP('HA3'!$L$14, Summary!$U:$V, 2, FALSE), \"\")","v":"+"},{"$f":"IFERROR(VLOOKUP('HA3'!$L$15, Summary!$U:$V, 2, FALSE), \"\")","v":"+ +"},{"$f":"IFERROR(VLOOKUP('HA3'!$L$16, Summary!$U:$V, 2, FALSE), \"\")","v":"+ +"},{"$f":"IFERROR(VLOOKUP('HA3'!$L$17, Summary!$U:$V, 2, FALSE), \"\")","v":"+"},{"$f":"IFERROR(VLOOKUP('HA3'!$L$18, Summary!$U:$V, 2, FALSE), \"\")","v":"-"},{"$f":"IFERROR(VLOOKUP('HA3'!$L$19, Summary!$U:$V, 2, FALSE), \"\")","v":0},{"$f":"IFERROR(VLOOKUP('HA3'!$L$20, Summary!$U:$V, 2, FALSE), \"\")","v":0},{"$f":"IFERROR(VLOOKUP('HA3'!$L$21, Summary!$U:$V, 2, FALSE), \"\")","v":"-"},{"$f":"IFERROR(VLOOKUP('HA3'!$L$22, Summary!$U:$V, 2, FALSE), \"\")","v":"-"},{"$f":"IFERROR(VLOOKUP('HA3'!$L$23, Summary!$U:$V, 2, FALSE), \"\")","v":"-"},{"$f":"IFERROR(VLOOKUP('HA3'!$L$24, Summary!$U:$V, 2, FALSE), \"\")","v":"+"},{"$f":"IFERROR(VLOOKUP('HA3'!$L$25, Summary!$U:$V, 2, FALSE), \"\")","v":"- -"},{"$f":"IFERROR(VLOOKUP('HA3'!$L$26, Summary!$U:$V, 2, FALSE), \"\")","v":"-"},null,"Neutral",0]
[null,"HA4",{"$f":"IFERROR(VLOOKUP('HA4'!$L$12, Summary!$U:$V, 2, FALSE), \"\")","v":"+"},{"$f":"IFERROR(VLOOKUP('HA4'!$L$13, Summary!$U:$V, 2, FALSE), \"\")","v":"+"},{"$f":"IFERROR(VLOOKUP('HA4'!$L$14, Summary!$U:$V, 2, FALSE), \"\")","v":"+"},{"$f":"IFERROR(VLOOKUP('HA4'!$L$15, Summary!$U:$V, 2, FALSE), \"\")","v":"+"},{"$f":"IFERROR(VLOOKUP('HA4'!$L$16, Summary!$U:$V, 2, FALSE), \"\")","v":"+"},{"$f":"IFERROR(VLOOKUP('HA4'!$L$17, Summary!$U:$V, 2, FALSE), \"\")","v":"+"},{"$f":"IFERROR(VLOOKUP('HA4'!$L$18, Summary!$U:$V, 2, FALSE), \"\")","v":"+"},{"$f":"IFERROR(VLOOKUP('HA4'!$L$19, Summary!$U:$V, 2, FALSE), \"\")","v":"+"},{"$f":"IFERROR(VLOOKUP('HA4'!$L$20, Summary!$U:$V, 2, FALSE), \"\")","v":"-"},{"$f":"IFERROR(VLOOKUP('HA4'!$L$21, Summary!$U:$V, 2, FALSE), \"\")","v":0},{"$f":"IFERROR(VLOOKUP('HA4'!$L$22, Summary!$U:$V, 2, FALSE), \"\")","v":"+"},{"$f":"IFERROR(VLOOKUP('HA4'!$L$23, Summary!$U:$V, 2, FALSE), \"\")","v":"-"},{"$f":"IFERROR(VLOOKUP('HA4'!$L$24, Summary!$U:$V, 2, FALSE), \"\")","v":"-"},{"$f":"IFERROR(VLOOKUP('HA4'!$L$25, Summary!$U:$V, 2, FALSE), \"\")","v":"-"},{"$f":"IFERROR(VLOOKUP('HA4'!$L$26, Summary!$U:$V, 2, FALSE), \"\")","v":"+"},{"$f":"IFERROR(VLOOKUP('HA4'!$L$27, Summary!$U:$V, 2, FALSE), \"\")","v":"- -"},{"$f":"IFERROR(VLOOKUP('HA4'!$L$28, Summary!$U:$V, 2, FALSE), \"\")","v":"-"},null,"Minor Negative","-"]
[null,"HA5",{"$f":"IFERROR(VLOOKUP('HA5'!$L$12, Summary!$U:$V, 2, FALSE), \"\")","v":"+ +"},{"$f":"IFERROR(VLOOKUP('HA5'!$L$13, Summary!$U:$V, 2, FALSE), \"\")","v":"+"},{"$f":"IFERROR(VLOOKUP('HA5'!$L$14, Summary!$U:$V, 2, FALSE), \"\")","v":"+"},{"$f":"IFERROR(VLOOKUP('HA5'!$L$15, Summary!$U:$V, 2, FALSE), \"\")","v":"+"},{"$f":"IFERROR(VLOOKUP('HA5'!$L$16, Summary!$U:$V, 2, FALSE), \"\")","v":"+"},{"$f":"IFERROR(VLOOKUP('HA5'!$L$17, Summary!$U:$V, 2, FALSE), \"\")","v":"+ +"},{"$f":"IFERROR(VLOOKUP('HA5'!$L$18, Summary!$U:$V, 2, FALSE), \"\")","v":"+ +"},{"$f":"IFERROR(VLOOKUP('HA5'!$L$19, Summary!$U:$V, 2, FALSE), \"\")","v":"+"},{"$f":"IFERROR(VLOOKUP('HA5'!$L$20, Summary!$U:$V, 2, FALSE), \"\")","v":"-"},{"$f":"IFERROR(VLOOKUP('HA5'!$L$21, Summary!$U:$V, 2, FALSE), \"\")","v":"+"},{"$f":"IFERROR(VLOOKUP('HA5'!$L$22, Summary!$U:$V, 2, FALSE), \"\")","v":"-"},{"$f":"IFERROR(VLOOKUP('HA5'!$L$23, Summary!$U:$V, 2, FALSE), \"\")","v":"-"},{"$f":"IFERROR(VLOOKUP('HA5'!$L$24, Summary!$U:$V, 2, FALSE), \"\")","v":"-"},{"$f":"IFERROR(VLOOKUP('HA5'!$L$25, Summary!$U:$V, 2, FALSE), \"\")","v":"-"},{"$f":"IFERROR(VLOOKUP('HA5'!$L$26, Summary!$U:$V, 2, FALSE), \"\")","v":"?"},{"$f":"IFERROR(VLOOKUP('HA5'!$L$27, Summary!$U:$V, 2, FALSE), \"\")","v":"- -"},{"$f":"IFERROR(VLOOKUP('HA5'!$L$28, Summary!$U:$V, 2, FALSE), \"\")","v":"-"},null,"Significant Negative","- -"]
{"$rows_left_out":22}
{"sheet":"HA1","index":6,"n_rows":28,"n_cols":16,"rows_kept":28,"cut":false,"hidden":false,"merged":[[9,0,9,1],[9,2,9,5],[9,6,9,15]]}
["Site Name","Rykneld Road, Littleover"]
["Site Address"]
["Town/Locality"]
["Est Housing Yield/Employment Space","800 homes"]
["Site Area (ha)"]
["Site Description"]
["Greenfield/Brownfield","Greenfield"]
["Assumptions Made"]
{"$rows_left_out":21}
{"sheet":"HA2","index":7,"n_rows":28,"n_cols":16,"rows_kept":28,"cut":false,"hidden":false,"merged":[[9,0,9,1],[9,2,9,5],[9,6,9,15]]}
["Site Name","Brook Farm, Chaddesden"]
["Site Address","Land to the north of Oregon Way and Tennessee Road"]
["Town/Locality"]
["Est Housing Yield/Employment Space",214]
["Site Area (ha)"]
["Site Description"]
["Greenfield/Brownfield","Greenfield"]
["Assumptions Made"]
{"$rows_left_out":21}
{"sheet":"HA3","index":8,"n_rows":26,"n_cols":16,"rows_kept":26,"cut":false,"hidden":false,"merged":[[7,0,7,1],[7,2,7,5],[7,6,7,15]]}
["Site Name"," East of Moorway Lane, Littleover"]
["Est Housing Yield/Employment Space",335]
["Site Area (ha)"]
["Site Description"]
["Greenfield/Brownfield","Greenfield"]
["Assumptions Made"]
[]
["SA Framework",null,"GIS Inputs",null,null,null,"SA  Assessment"]
{"$rows_left_out":19}
{"sheet":"HA4","index":9,"n_rows":28,"n_cols":16,"rows_kept":28,"cut":false,"hidden":false,"merged":[[9,0,9,1],[9,2,9,5],[9,6,9,15]]}
["Site Name"," Royal Hill Road, Spondon"]
["Site Address"]
["Town/Locality"]
["Est Housing Yield/Employment Space",90]
["Site Area (ha)"]
["Site Description"]
["Greenfield/Brownfield","Greenfield"]
["Assumptions Made"]
{"$rows_left_out":21}
{"sheet":"HA5","index":10,"n_rows":28,"n_cols":16,"rows_kept":28,"cut":false,"hidden":false,"merged":[[9,0,9,1],[9,2,9,5],[9,6,9,15]]}
["Site Name","The Hollow, Mickleover"]
["Site Address"]
["Town/Locality"]
["Est Housing Yield/Employment Space",150]
["Site Area (ha)"]
["Site Description"]
["Greenfield/Brownfield","Greenfield"]
["Assumptions Made"]
{"$rows_left_out":21}
{"sheet":"HA6","index":11,"n_rows":28,"n_cols":16,"rows_kept":28,"cut":false,"hidden":false,"merged":[[9,0,9,1],[9,2,9,5],[9,6,9,15]]}
["Site Name","Former Manor/Kingsway Hospital"]
["Site Address"]
["Town/Locality"]
["Est Housing Yield/Employment Space",130]
["Site Area (ha)"]
["Site Description"]
["Greenfield/Brownfield","Brownfield"]
["Assumptions Made"]
{"$rows_left_out":21}
{"sheet":"HA7","index":12,"n_rows":28,"n_cols":16,"rows_kept":28,"cut":false,"hidden":false,"merged":[[9,0,9,1],[9,2,9,5],[9,6,9,15]]}
["Site Name","Stoney Lane, Spondon"]
["Site Address"]
["Town/Locality"]
["Est Housing Yield/Employment Space",400]
["Site Area (ha)"]
["Site Description"]
["Greenfield/Brownfield","Greenfield"]
["Assumptions Made"]
{"$rows_left_out":21}
{"sheet":"HA8","index":13,"n_rows":28,"n_cols":16,"rows_kept":28,"cut":false,"hidden":false,"merged":[[9,0,9,1],[9,2,9,5],[9,6,9,15]]}
["Site Name","Former Police Station, Cotton Lane"]
["Site Address"]
["Town/Locality"]
["Est Housing Yield/Employment Space",100]
["Site Area (ha)"]
["Site Description"]
["Greenfield/Brownfield","Brownfield"]
["Assumptions Made"]
{"$rows_left_out":21}
{"sheet":"HA9","index":14,"n_rows":28,"n_cols":16,"rows_kept":28,"cut":false,"hidden":false,"merged":[[9,0,9,1],[9,2,9,5],[9,6,9,15]]}
["Site Name","Bramblebrook House/Humbleton View, Littleover"]
["Site Address"]
["Town/Locality"]
["Est Housing Yield/Employment Space",90]
["Site Area (ha)"]
["Site Description"]
["Greenfield/Brownfield","Brownfield"]
["Assumptions Made"]
{"$rows_left_out":21}
{"sheet":"HA10","index":15,"n_rows":28,"n_cols":16,"rows_kept":28,"cut":false,"hidden":false,"merged":[[9,0,9,1],[9,2,9,5],[9,6,9,15]]}
["Site Name","Elton Road Works, Osmaston"]
["Site Address"]
["Town/Locality"]
["Est Housing Yield/Employment Space","80 dwellings"]
["Site Area (ha)"]
["Site Description"]
["Greenfield/Brownfield","Brownfield"]
["Assumptions Made"]
{"$rows_left_out":21}
{"sheet":"HA11","index":16,"n_rows":28,"n_cols":16,"rows_kept":28,"cut":false,"hidden":false,"merged":[[9,0,9,1],[9,2,9,5],[9,6,9,15]]}
["Site Name","Former Shaftesbury Leisure Centre"]
["Site Address"]
["Town/Locality"]
["Est Housing Yield/Employment Space","20 dwellings "]
["Site Area (ha)"]
["Site Description"]
["Greenfield/Brownfield","Greenfield/ Brownfield"]
["Assumptions Made"]
{"$rows_left_out":21}
{"sheet":"HA12","index":17,"n_rows":28,"n_cols":16,"rows_kept":28,"cut":false,"hidden":false,"merged":[[9,0,9,1],[9,2,9,5],[9,6,9,15]]}
["Site Name","North of Sinfin Moor Lane"]
["Site Address"]
["Town/Locality"]
["Est Housing Yield/Employment Space","40 homes"]
["Site Area (ha)"]
["Site Description"]
["Greenfield/Brownfield","Greenfield"]
["Assumptions Made"]
{"$rows_left_out":21}
{"sheet":"HA13","index":18,"n_rows":28,"n_cols":16,"rows_kept":28,"cut":false,"hidden":false,"merged":[[9,0,9,1],[9,2,9,5],[9,6,9,15]]}
["Site Name","Bembridge Drive, Alvaston"]
["Site Address"]
["Town/Locality"]
["Est Housing Yield/Employment Space","30 dwellings"]
["Site Area (ha)"]
["Site Description"]
["Greenfield/Brownfield","Greenfield"]
["Assumptions Made"]
{"$rows_left_out":21}
{"sheet":"HA14","index":19,"n_rows":28,"n_cols":16,"rows_kept":28,"cut":false,"hidden":false,"merged":[[9,0,9,1],[9,2,9,5],[9,6,9,15]]}
["Site Name","Former Beaufort Business Centre"]
["Site Address"]
["Town/Locality","Chaddesden"]
["Est Housing Yield/Employment Space","30 dwellings"]
["Site Area (ha)"]
["Site Description"]
["Greenfield/Brownfield","Brownfield"]
["Assumptions Made"]
{"$rows_left_out":21}
{"sheet":"HA15","index":20,"n_rows":28,"n_cols":16,"rows_kept":28,"cut":false,"hidden":false,"merged":[[9,0,9,1],[9,2,9,5],[9,6,9,15]]}
["Site Name","Kitchner Avenue/Browning Street"]
["Site Address"]
["Town/Locality"]
["Est Housing Yield/Employment Space","25 dwellings "]
["Site Area (ha)"]
["Site Description"]
["Greenfield/Brownfield","Greenfield"]
["Assumptions Made"]
{"$rows_left_out":21}
{"sheet":"HA16","index":21,"n_rows":28,"n_cols":16,"rows_kept":28,"cut":false,"hidden":false,"merged":[[9,0,9,1],[9,2,9,5],[9,6,9,15]]}
["Site Name","Former Ivy School House"]
["Site Address"]
["Town/Locality"]
["Est Housing Yield/Employment Space","25 dwellings"]
["Site Area (ha)"]
["Site Description"]
["Greenfield/Brownfield","Brownfield "]
["Assumptions Made"]
{"$rows_left_out":21}
{"sheet":"HA17","index":22,"n_rows":28,"n_cols":16,"rows_kept":28,"cut":false,"hidden":false,"merged":[[9,0,9,1],[9,2,9,5],[9,6,9,15]]}
["Site Name","Gypsy and Traveller Site Allocation"]
["Site Address"]
["Town/Locality"]
["Est Housing Yield/Employment Space","17 permanent caravan pitches"]
["Site Area (ha)"]
["Site Description","Greenfield"]
["Greenfield/Brownfield","Greenfield"]
["Assumptions Made"]
{"$rows_left_out":21}
{"sheet":"CC4","index":23,"n_rows":28,"n_cols":16,"rows_kept":28,"cut":false,"hidden":false,"merged":[[9,0,9,1],[9,2,9,5],[9,6,9,15]]}
["Site Name","Residential Led, Mixed Use Site Allocations"]
["Site Address"]
["Town/Locality","Derby "]
["Est Housing Yield/Employment Space","Friar Gate Goods Yard: 276 homes\nFull Street Police Station: 195 homes\nNorthern Gateway: 200 homes\nBradshaw Way: 400 homes\nThe Eagle Quarter: 400 homes\nAbbey Street Car Park: 50 homes\nBabington Lane Car Park: 200 homes\nRemaining Land at Becketwell: 150 homes\nTotal homes: 1871"]
["Site Area (ha)"]
["Site Description"]
["Greenfield/Brownfield"]
["Assumptions Made"]
{"$rows_left_out":21}
{"sheet":"CC5","index":24,"n_rows":28,"n_cols":16,"rows_kept":28,"cut":false,"hidden":false,"merged":[[9,0,9,1],[9,2,9,5],[9,6,9,15]]}
["Site Name","Non-Residential Regeneration Opportunities"]
["Site Address","The Market Place\nDerby Museum, Art Gallery and former Central Library\nUniversity of Derby City Centre Hub (Also, CC13)"]
["Town/Locality"]
["Est Housing Yield/Employment Space","Non-residential mixed use development"]
["Site Area (ha)"]
["Site Description"]
["Greenfield/Brownfield","Brownfield"]
["Assumptions Made"]
{"$rows_left_out":21}
{"sheet":"CC12","index":25,"n_rows":28,"n_cols":16,"rows_kept":28,"cut":false,"hidden":false,"merged":[[9,0,9,1],[9,2,9,5],[9,6,9,15]]}
["Site Name","Derby Riverside"]
["Site Address"]
["Town/Locality"]
["Est Housing Yield/Employment Space","600 dwellings"]
["Site Area (ha)"]
["Site Description"]
["Greenfield/Brownfield"]
["Assumptions Made"]
{"$rows_left_out":21}
{"sheet":"CC13","index":26,"n_rows":28,"n_cols":16,"rows_kept":28,"cut":false,"hidden":false,"merged":[[9,0,9,1],[9,2,9,5],[9,6,9,15]]}
["Site Name","University of Derby, City Centre Hub"]
["Site Address","Markeaton Street/Britannia Mill/Agard Street/Markeaton Brook/Bridge Street"]
["Town/Locality"]
["Est Housing Yield/Employment Space","Development of a new centrally located campus"]
["Site Area (ha)"]
["Site Description"]
["Greenfield/Brownfield","Brownfield"]
["Assumptions Made"]
{"$rows_left_out":21}
{"sheet":"CC14","index":27,"n_rows":28,"n_cols":16,"rows_kept":28,"cut":false,"hidden":false,"merged":[[9,0,9,1],[9,2,9,5],[9,6,9,15]]}
["Site Name","Railway Station Quarter"]
["Site Address"]
["Town/Locality"]
["Est Housing Yield/Employment Space","500 dwellings"]
["Site Area (ha)"]
["Site Description"]
["Greenfield/Brownfield","Brownfield"]
["Assumptions Made"]
{"$rows_left_out":21}
{"sheet":"CC15","index":28,"n_rows":28,"n_cols":16,"rows_kept":28,"cut":false,"hidden":false,"merged":[[9,0,9,1],[9,2,9,5],[9,6,9,15]]}
["Site Name","North Castleward"]
["Site Address"]
["Town/Locality"]
["Est Housing Yield/Employment Space","400 dwellings "]
["Site Area (ha)"]
["Site Description"]
["Greenfield/Brownfield","Brownfield"]
["Assumptions Made"]
{"$rows_left_out":21}
{"sheet":"E5","index":29,"n_rows":28,"n_cols":16,"rows_kept":28,"cut":false,"hidden":false,"merged":[[9,0,9,1],[9,2,9,5],[9,6,9,15]]}
["Site Name","Land South of Wilmore Road (Infinity Park)"]
["Site Address"]
["Town/Locality"]
["Est Housing Yield/Employment Space","Advanced manufacturing and logistics business park, B2 and B8 uses, office space (E(g)(i)) and research and development (E(g)(ii))"]
["Site Area (ha)","88.7ha"]
["Site Description"]
["Greenfield/Brownfield","Greenfield and Brownfield"]
["Assumptions Made"]
{"$rows_left_out":21}
{"sheet":"E6","index":30,"n_rows":28,"n_cols":16,"rows_kept":28,"cut":false,"hidden":false,"merged":[[9,0,9,1],[9,2,9,5],[9,6,9,15]]}
["Site Name","SmartParc, Spondon"]
["Site Address"]
["Town/Locality"]
["Est Housing Yield/Employment Space","Research, production, distribution, training and education related to the food and drink industry\nContinued support of new manufacturing (B2), storage and distribution (B8) uses and other ancillary uses where justified. Potential for new office development."]
["Site Area (ha)","51.7ha"]
["Site Description"]
["Greenfield/Brownfield","Brownfield"]
["Assumptions Made"]
{"$rows_left_out":21}
{"sheet":"E7","index":31,"n_rows":28,"n_cols":16,"rows_kept":28,"cut":false,"hidden":false,"merged":[[9,0,9,1],[9,2,9,5],[9,6,9,15]]}
["Site Name","Indurent Park"]
["Site Address"]
["Town/Locality"]
["Est Housing Yield/Employment Space","Manufacturing (B2) and storage and distribution (B8), potential for new office development."]
["Site Area (ha)","20.9ha"]
["Site Description"]
["Greenfield/Brownfield","Brownfield"]
["Assumptions Made"]
{"$rows_left_out":20}